CH2=NO anion

Reaction thermochemistry data

Data compiled by: John E. Bartmess

Individual Reactions

CH2NO- + Hydrogen cation = formaldehyde oxime

By formula: CH2NO- + H+ = CH3NO

Quantity Value Units Method Reference Comment
Δr<1557.3kJ/molAcidDiDomenico and Franklin, 1972gas phase; From MeNO2. G3MP2B3 calculations indicate a HOF(A-) of +3 kcal/mol

References

DiDomenico and Franklin, 1972
DiDomenico, A.; Franklin, J.L., Negative ions in the mass spectrum of nitromethane, Int. J. Mass Spectrom. Ion Phys., 1972, 9, 171. [all data]