FCðC anion

Reaction thermochemistry data

Data compiled by: John E. Bartmess

Individual Reactions

C2F- + Hydrogen cation = Ethyne, fluoro-

By formula: C2F- + H+ = C2HF

Quantity Value Units Method Reference Comment
Δr<368. ± 19.kcal/molD-EAThynne and MacNiel, 1971gas phase; From CH2=CF2
Quantity Value Units Method Reference Comment
Δr<360. ± 19.kcal/molH-TSThynne and MacNiel, 1971gas phase; From CH2=CF2

Gas phase ion energetics data

Data compiled by: John E. Bartmess

Electron affinity of neutral species

EAneutral (eV) Method Reference Comment
>3.40 ± 0.80EIAEThynne and MacNiel, 1971From CH2=CF2

Protonation reactions

C2F- + Hydrogen cation = Ethyne, fluoro-

By formula: C2F- + H+ = C2HF

Quantity Value Units Method Reference Comment
Δr<368. ± 19.kcal/molD-EAThynne and MacNiel, 1971gas phase; From CH2=CF2
Quantity Value Units Method Reference Comment
Δr<360. ± 19.kcal/molH-TSThynne and MacNiel, 1971gas phase; From CH2=CF2

References

Thynne and MacNiel, 1971
Thynne, J.C.J.; MacNiel, K.A.G., Negative ion formation by ethylene and 1,1-difluoroethylene, J. Phys. Chem., 1971, 75, 2584. [all data]