Cyclooctatetraene anion

Gas phase thermochemistry data

Data compiled by: John E. Bartmess

Quantity Value Units Method Reference Comment
Δfgas58.04 ± 0.62kcal/molR-EAKato, Lee, et al., 1997

References

Kato, Lee, et al., 1997
Kato, S.; Lee, H.S.; Gareyev, R.; Wenthold, P.G.; Lineberger, W.C.; DePuy, C.H.; Bierbaum, V.M., Experimental and Computational Studies of the Structures and Energetics of Cyclooctatetraene and Its Derivatives, J. Am. Chem. Soc., 1997, 119, 33, 7863, https://doi.org/10.1021/ja971433d . [all data]