P2 anion

Gas phase thermochemistry data

Data compiled by: John E. Bartmess

Quantity Value Units Method Reference Comment
Δfgas87.2 ± 3.1kJ/molR-EASnodgrass, Coe, et al., 1985
Δfgas156. ± 20.kJ/molEIAEBennett, Margrave, et al., 1974From P4

References

Snodgrass, Coe, et al., 1985
Snodgrass, J.T.; Coe, J.V.; Freidhoff, C.B.; McHugh, K.M.; Bowen, K.H., Negative ion photoelectron spectroscopy of P2-, Chem. Phys. Lett., 1985, 122, 352. [all data]

Bennett, Margrave, et al., 1974
Bennett, S.L.; Margrave, J.L.; Franklin, J.L., High temperature negative ions. Electron impact study of tetratomic phosphorous vapor, J. Chem. Phys., 1974, 61, 1647. [all data]