C2Cl5 anion

Reaction thermochemistry data

Data compiled by: John E. Bartmess

Individual Reactions

C2Cl5- + Hydrogen cation = Ethane, pentachloro-

By formula: C2Cl5- + H+ = C2HCl5

Quantity Value Units Method Reference Comment
Δr1559. ± 10.kJ/molD-EAGaines, Kay, et al., 1966gas phase; The Magnetron method, lacking mass analysis, is not considered reliable. G3MP2B3 calculations indicate an EA of ca. 3.2 eV

Gas phase ion energetics data

Data compiled by: John E. Bartmess

Electron affinity of neutral species

EAneutral (eV) Method Reference Comment
1.54376SIGaines, Kay, et al., 1966The Magnetron method, lacking mass analysis, is not considered reliable. G3MP2B3 calculations indicate an EA of ca. 3.2 eV

Protonation reactions

C2Cl5- + Hydrogen cation = Ethane, pentachloro-

By formula: C2Cl5- + H+ = C2HCl5

Quantity Value Units Method Reference Comment
Δr1559. ± 10.kJ/molD-EAGaines, Kay, et al., 1966gas phase; The Magnetron method, lacking mass analysis, is not considered reliable. G3MP2B3 calculations indicate an EA of ca. 3.2 eV

References

Gaines, Kay, et al., 1966
Gaines, A.F.; Kay, J.; Page, F.M., Determination of Electron Affinities. Part 8. - CCl4, CHCl3, and CH2Cl2, Trans. Farad. Soc., 1966, 62, 874, https://doi.org/10.1039/tf9666200874 . [all data]