C2F5 anion

Reaction thermochemistry data

Data compiled by: John E. Bartmess

Individual Reactions

C2F5- + Hydrogen cation = Ethane, pentafluoro-

By formula: C2F5- + H+ = C2HF5

Quantity Value Units Method Reference Comment
Δr1567. ± 14.kJ/molG+TSSullivan and Beauchamp, 1976gas phase; Between tBuOH and HF; value altered from reference due to change in acidity scale
Quantity Value Units Method Reference Comment
Δr1535. ± 13.kJ/molIMRBSullivan and Beauchamp, 1976gas phase; Between tBuOH and HF; value altered from reference due to change in acidity scale

Gas phase ion energetics data

Data compiled by: John E. Bartmess

Protonation reactions

C2F5- + Hydrogen cation = Ethane, pentafluoro-

By formula: C2F5- + H+ = C2HF5

Quantity Value Units Method Reference Comment
Δr1567. ± 14.kJ/molG+TSSullivan and Beauchamp, 1976gas phase; Between tBuOH and HF; value altered from reference due to change in acidity scale
Quantity Value Units Method Reference Comment
Δr1535. ± 13.kJ/molIMRBSullivan and Beauchamp, 1976gas phase; Between tBuOH and HF; value altered from reference due to change in acidity scale

References

Sullivan and Beauchamp, 1976
Sullivan, S.A.; Beauchamp, J.L., Competition between proton transfer and elimination in the reactions of strong bases with fluoroethanes in the gas phase. Influence of base strength on reactivity, J. Am. Chem. Soc., 1976, 98, 1160. [all data]