cyclohexanide anion

Reaction thermochemistry data

Data compiled by: John E. Bartmess

Individual Reactions

C6H11- + Hydrogen cation = Cyclohexane

By formula: C6H11- + H+ = C6H12

Quantity Value Units Method Reference Comment
Δr1750. ± 8.4kJ/molBranPeerboom, Rademaker, et al., 1992gas phase
Δr1702.1 ± 3.8kJ/molG+TSBohme, Lee-Ruff, et al., 1972gas phase
Quantity Value Units Method Reference Comment
Δr1713. ± 9.2kJ/molH-TSPeerboom, Rademaker, et al., 1992gas phase
Δr>1665.2kJ/molIMRBBohme, Lee-Ruff, et al., 1972gas phase

References

Peerboom, Rademaker, et al., 1992
Peerboom, R.A.L.; Rademaker, G.J.; Dekoning, L.J.; Nibbering, N.M.M., Stabilization of Cycloalkyl Carbanions in the Gas Phase, Rapid Commun. Mass Spectrom., 1992, 6, 6, 394, https://doi.org/10.1002/rcm.1290060608 . [all data]

Bohme, Lee-Ruff, et al., 1972
Bohme, D.K.; Lee-Ruff, E.; Young, L.B., Acidity order of selected bronsted acids in the gas phase at 300K, J. Am. Chem. Soc., 1972, 94, 5153. [all data]