Me3C anion

Reaction thermochemistry data

Data compiled by: John E. Bartmess

Individual Reactions

C4H9- + Hydrogen cation = Isobutane

By formula: C4H9- + H+ = C4H10

Quantity Value Units Method Reference Comment
Δr1728. ± 8.4kJ/molBranDePuy, Gronert, et al., 1989gas phase
Δr1732. ± 8.4kJ/molBranDePuy, Bierbaum, et al., 1984gas phase
Quantity Value Units Method Reference Comment
Δr1697. ± 8.8kJ/molH-TSDePuy, Gronert, et al., 1989gas phase

Gas phase ion energetics data

Data compiled by: John E. Bartmess

Protonation reactions

C4H9- + Hydrogen cation = Isobutane

By formula: C4H9- + H+ = C4H10

Quantity Value Units Method Reference Comment
Δr1728. ± 8.4kJ/molBranDePuy, Gronert, et al., 1989gas phase
Δr1732. ± 8.4kJ/molBranDePuy, Bierbaum, et al., 1984gas phase
Quantity Value Units Method Reference Comment
Δr1697. ± 8.8kJ/molH-TSDePuy, Gronert, et al., 1989gas phase

References

DePuy, Gronert, et al., 1989
DePuy, C.H.; Gronert, S.; Barlow, S.E.; Bierbaum, V.M.; Damrauer, R., The Gas Phase Acidities of the Alkanes, J. Am. Chem. Soc., 1989, 111, 6, 1968, https://doi.org/10.1021/ja00188a003 . [all data]

DePuy, Bierbaum, et al., 1984
DePuy, C.H.; Bierbaum, V.M.; Damrauer, R., Relative Gas-Phase Acidities of the Alkanes, J. Am. Chem. Soc., 1984, 106, 4051. [all data]