HCF2 anion

Reaction thermochemistry data

Data compiled by: John E. Bartmess

Individual Reactions

CHF2- + Hydrogen cation = Difluoromethane

By formula: CHF2- + H+ = CH2F2

Quantity Value Units Method Reference Comment
Δr1628. ± 15.kJ/molCIDTGraul and Squires, 1990gas phase; G2 calculations( Lee, Dyke, et al., 1998) predict ΔHacid = 399 kcal/mol
Quantity Value Units Method Reference Comment
Δr1595. ± 15.kJ/molH-TSGraul and Squires, 1990gas phase; G2 calculations( Lee, Dyke, et al., 1998) predict ΔHacid = 399 kcal/mol
Δr1586. ± 25.kJ/molIMRBSullivan, 1977gas phase

References

Graul and Squires, 1990
Graul, S.T.; Squires, R.R., Gas-Phase Acidities Derived from Threshold Energies for Activated Reactions, J. Am. Chem. Soc., 1990, 112, 7, 2517, https://doi.org/10.1021/ja00163a007 . [all data]

Lee, Dyke, et al., 1998
Lee, E.P.F.; Dyke, J.M.; Mayhew, C.A., Study of the OH-+CH2F2 reaction by selected ion flow tube experiments and ab initio calculations, J. Phys. Chem. A, 1998, 102, 43, 8349-8354, https://doi.org/10.1021/jp982224y . [all data]

Sullivan, 1977
Sullivan, S.A., Thesis, Cal. Inst. Tech. thesis,, 1977. [all data]