C6Cl5 anion

Reaction thermochemistry data

Data compiled by: John E. Bartmess

Individual Reactions

C6Cl5- + Hydrogen cation = Benzene, pentachloro-

By formula: C6Cl5- + H+ = C6HCl5

Quantity Value Units Method Reference Comment
Δr1486. ± 8.8kJ/molG+TSSchlosser, Marzi, et al., 2001gas phase
Quantity Value Units Method Reference Comment
Δr1454. ± 8.4kJ/molIMRESchlosser, Marzi, et al., 2001gas phase

Gas phase ion energetics data

Data compiled by: John E. Bartmess

Electron affinity of neutral species

EAneutral (eV) Method Reference Comment
3.10 ± 0.24D-EASchlosser, Marzi, et al., 2001
2.75796SIPage and Goode, 1969The Magnetron method, lacking mass analysis, is not considered reliable.

Protonation reactions

C6Cl5- + Hydrogen cation = Benzene, pentachloro-

By formula: C6Cl5- + H+ = C6HCl5

Quantity Value Units Method Reference Comment
Δr355.1 ± 2.1kcal/molG+TSSchlosser, Marzi, et al., 2001gas phase
Quantity Value Units Method Reference Comment
Δr347.4 ± 2.0kcal/molIMRESchlosser, Marzi, et al., 2001gas phase

References

Schlosser, Marzi, et al., 2001
Schlosser, M.; Marzi, E.; Cottet, F.; Buker, H.H.; Nibbering, N.M.M., The acidity of chloro-substituted benzenes: A comparison of gas phase, ab initio, and kinetic data, Chem. Eur. J., 2001, 7, 16, 3511-3516, https://doi.org/10.1002/1521-3765(20010817)7:16<3511::AID-CHEM3511>3.0.CO;2-U . [all data]