norbornadienide anion

Reaction thermochemistry data

Data compiled by: John E. Bartmess

Individual Reactions

C7H7- + Hydrogen cation = 2,5-Norbornadiene

By formula: C7H7- + H+ = C7H8

Quantity Value Units Method Reference Comment
Δr1672. ± 7.5kJ/molG+TSLee and Squires, 1986gas phase; Between EtNH2, nPrNH2
Quantity Value Units Method Reference Comment
Δr1637. ± 6.3kJ/molIMRBLee and Squires, 1986gas phase; Between EtNH2, nPrNH2
Δr1628. ± 21.kJ/molIMRBWright and Beauchamp, 1981gas phase

References

Lee and Squires, 1986
Lee, R.E.; Squires, R.R., Anionic homoaromaticity: A gas phase experimental study, J. Am. Chem. Soc., 1986, 105, 5078. [all data]

Wright and Beauchamp, 1981
Wright, C.A.; Beauchamp, J.L., Infrared spectra of gas phase ions and their use in elucidating reaction mechanisms. Identification of C7H7- structural isomers by multiphoton electron detachment using a low-powered laser, J. Am. Chem. Soc., 1981, 103, 6499. [all data]