CH2=CCN anion

Reaction thermochemistry data

Data compiled by: John E. Bartmess

Individual Reactions

C3H2N- + Hydrogen cation = 2-Propenenitrile

By formula: C3H2N- + H+ = C3H3N

Quantity Value Units Method Reference Comment
Δr1553. ± 9.2kJ/molG+TSBartmess, 1980gas phase; value altered from reference due to change in acidity scale
Δr1524. ± 19.kJ/molEIAEHeni and Illenberger, 1986gas phase; From CH2=CHCN. G3MP2B3 calculations indicate a dHacdi ca. 374 kcal/mol
Quantity Value Units Method Reference Comment
Δr1528. ± 8.4kJ/molIMREBartmess, 1980gas phase; value altered from reference due to change in acidity scale

Gas phase ion energetics data

Data compiled by: John E. Bartmess

Protonation reactions

C3H2N- + Hydrogen cation = 2-Propenenitrile

By formula: C3H2N- + H+ = C3H3N

Quantity Value Units Method Reference Comment
Δr1553. ± 9.2kJ/molG+TSBartmess, 1980gas phase; value altered from reference due to change in acidity scale
Δr1524. ± 19.kJ/molEIAEHeni and Illenberger, 1986gas phase; From CH2=CHCN. G3MP2B3 calculations indicate a dHacdi ca. 374 kcal/mol
Quantity Value Units Method Reference Comment
Δr1528. ± 8.4kJ/molIMREBartmess, 1980gas phase; value altered from reference due to change in acidity scale

References

Bartmess, 1980
Bartmess, J.E., Solvent effects on ion-molecule reactions. Vinyl anions vs. conjugate addition, J. Am. Chem. Soc., 1980, 102, 2483. [all data]

Heni and Illenberger, 1986
Heni, M.; Illenberger, E., Electron attachment by saturated nitriles. Acrylonitrile (CH2H3CN), and benzonitrile (C6H5CN), Int. J. Mass Spectrom. Ion Phys., 1986, 73, 127. [all data]