HCðCO anion

Reaction thermochemistry data

Data compiled by: John E. Bartmess

Individual Reactions

C2HO- + Hydrogen cation = Ketene

By formula: C2HO- + H+ = C2H2O

Quantity Value Units Method Reference Comment
Δr1526. ± 8.8kJ/molG+TSOakes, Jones, et al., 1983gas phase; Acid: ketene; value altered from reference due to change in acidity scale
Quantity Value Units Method Reference Comment
Δr1497. ± 8.4kJ/molIMRBOakes, Jones, et al., 1983gas phase; Acid: ketene; value altered from reference due to change in acidity scale

Gas phase ion energetics data

Data compiled by: John E. Bartmess

Protonation reactions

C2HO- + Hydrogen cation = Ketene

By formula: C2HO- + H+ = C2H2O

Quantity Value Units Method Reference Comment
Δr1526. ± 8.8kJ/molG+TSOakes, Jones, et al., 1983gas phase; Acid: ketene; value altered from reference due to change in acidity scale
Quantity Value Units Method Reference Comment
Δr1497. ± 8.4kJ/molIMRBOakes, Jones, et al., 1983gas phase; Acid: ketene; value altered from reference due to change in acidity scale

References

Oakes, Jones, et al., 1983
Oakes, J.M.; Jones, M.E.; Bierbaum, V.M.; Ellison, G.B., Photoelectron spectroscopy of CCO- and HCCO-, J. Phys. Chem., 1983, 87, 4810. [all data]