ClO anion

Gas phase ion energetics data

Data compiled by: John E. Bartmess

Protonation reactions

ClO- + Hydrogen cation = Hypochlorous acid

By formula: ClO- + H+ = HClO

Quantity Value Units Method Reference Comment
Δr1488. ± 4.6kJ/molD-EADistelrath and Boesl, 2000gas phase
Quantity Value Units Method Reference Comment
Δr1461. ± 5.0kJ/molH-TSDistelrath and Boesl, 2000gas phase

Reaction thermochemistry data

Data compiled by: John E. Bartmess

Individual Reactions

ClO- + Hydrogen cation = Hypochlorous acid

By formula: ClO- + H+ = HClO

Quantity Value Units Method Reference Comment
Δr1488. ± 4.6kJ/molD-EADistelrath and Boesl, 2000gas phase
Quantity Value Units Method Reference Comment
Δr1461. ± 5.0kJ/molH-TSDistelrath and Boesl, 2000gas phase

References

Distelrath and Boesl, 2000
Distelrath, V.; Boesl, U., Mass selective gas phase study of ClO, OClO, ClOO and ClAr by anion-ZEKE-photoelectron spectroscopy, Faraday Disc. Chem. Soc., 2000, 115, 161-174, https://doi.org/10.1039/a909618c . [all data]