CF3CðC anion

Reaction thermochemistry data

Data compiled by: John E. Bartmess

Individual Reactions

C3F3- + Hydrogen cation = (Trifluoromethyl)acetylene

By formula: C3F3- + H+ = C3HF3

Quantity Value Units Method Reference Comment
Δr1486. ± 8.8kJ/molG+TSTaft and Topsom, 1987gas phase; value altered from reference due to change in acidity scale
Quantity Value Units Method Reference Comment
Δr1454. ± 8.4kJ/molIMRETaft and Topsom, 1987gas phase; value altered from reference due to change in acidity scale

References

Taft and Topsom, 1987
Taft, R.W.; Topsom, R.D., The Nature and Analysis of Substituent Effects, Prog. Phys. Org. Chem., 1987, 16, 1. [all data]