Nb3C7 radical anion

Gas phase ion energetics data

Data compiled by: John E. Bartmess

Electron affinity of neutral species

EAneutral (eV) Method Reference Comment
1.74 ± 0.20LPESClayborne, Jones, et al., 2010Vertical Detachment Energy: 2.33±0.20 eV

References

Clayborne, Jones, et al., 2010
Clayborne, P.A.; Jones, C.E.; Gupta, U.; Melko, J.J.; Khanna, S.N.; Castleman, A.W., Structural Evolution of Triniobium Carbide Clusters: Evidence of Large C-n Chains (n=3-4) in Nb3Cn- (n=5-10) Clusters, J. Phys. Chem. A, 2010, 114, 3, 1290-1297, https://doi.org/10.1021/jp905022p . [all data]