Sc(SCN)4 anion

Gas phase ion energetics data

Data compiled by: John E. Bartmess

Electron affinity of neutral species

EAneutral (eV) Method Reference Comment
5.980 ± 0.050LPESYang, Wang, et al., 2003Vertical Detachment Energy: 6.20±0.05 eV

References

Yang, Wang, et al., 2003
Yang, X.; Wang, X.B.; Fu, Y.J.; Wang, L.S., On the electronic structure of [1Fe] Fe-S complexes from anionic photoelectron spectroscopy, J. Phys. Chem. A, 2003, 107, 11, 1703-1709, https://doi.org/10.1021/jp027118h . [all data]