Cu(SMe)2 anion

Gas phase ion energetics data

Data compiled by: John E. Bartmess

Electron affinity of neutral species

EAneutral (eV) Method Reference Comment
3.420 ± 0.070LPESNiu, Huang, et al., 2014Stated electron affinity is the Vertical Detachment Energy

References

Niu, Huang, et al., 2014
Niu, S.Q.; Huang, D.L.; Dau, P.D.; Liu, H.T.; Wang, L.S.; Ichiye, T., Assessment of Quantum Mechanical Methods for Copper and Iron Complexes by Photoelectron Spectroscopy, Journal Of Chemical Theory And Computation, 2014, 10, 3, 1283-1291, https://doi.org/10.1021/ct400842p . [all data]