mCF3-C6H4C(SO2CF3)2 anion

Reaction thermochemistry data

Data compiled by: John E. Bartmess

Individual Reactions

C10H4F9O4S2- + Hydrogen cation = C10H5F9O4S2

By formula: C10H4F9O4S2- + H+ = C10H5F9O4S2

Quantity Value Units Method Reference Comment
Δr1240.1kJ/molIMREZhang, Badal, et al., 2013gas phase

References

Zhang, Badal, et al., 2013
Zhang, M.; Badal, M.M.R.; Koppel, I.A.; Mishima, M., Gas-Phase Acidities of alpha- and alpha,alpha-SO2CF3-Substituted Toluenes. Varying Resonance Demand in the Electron-Rich System, Bull. Chem. Soc. Japan, 2013, 86, 7, 813-820, https://doi.org/10.1246/bcsj.20130052 . [all data]