p-vinylidene-(4(2,3-dimethyl-5-imidazolone))-phenoxide anion

Gas phase ion energetics data

Data compiled by: John E. Bartmess

Electron affinity of neutral species

EAneutral (eV) Method Reference Comment
2.85 ± 0.10LPESMooney, Sanz, et al., 2012Stated electron affinity is the Vertical Detachment Energy

References

Mooney, Sanz, et al., 2012
Mooney, C.R.S.; Sanz, M.E.; McKay, A.R.; Fitzmaurice, R.J.; Aliev, A.E.; Caddick, S.; Fielding, H.H., Photodetachment Spectra of Deprotonated Fluoresent Protein Chromophore Anions, J. Phys. Chem., 2012, 116, 30, 7943-7949, https://doi.org/10.1021/jp3058349 . [all data]