MgO4 radical anion

Gas phase ion energetics data

Data compiled by: John E. Bartmess

Electron affinity of neutral species

EAneutral (eV) Reference Comment
1.620 ± 0.070Cheng, Berkdemir, et al., 2013Vertical Detachment Energy: 2.02±0.16 eV

References

Cheng, Berkdemir, et al., 2013
Cheng, S.B.; Berkdemir, C.; Melko, J.J.; Castleman, A.W., Probing the Electronic Structures and Relative Stabilities of Monomagnesium Oxide Clusters MgOx- and MgOx (x=1-4): A Combined Photoelectron Imaging and Theoretical Investigation, J. Phys. Chem. A, 2013, 117, 46, 11896-11905, https://doi.org/10.1021/jp403134g . [all data]