Li(IO3)2 anion

Gas phase ion energetics data

Data compiled by: John E. Bartmess

Electron affinity of neutral species

EAneutral (eV) Method Reference Comment
6.320 ± 0.080LPESHou, Wu, et al., 2013Vertical Detachment Energy: 6.57±0.10 eV

References

Hou, Wu, et al., 2013
Hou, G.L.; Wu, M.M.; Wen, H.; Sun, Q.; Wang, X.B.; Zheng, W.J., Photoelectron spectroscopy and theoretical study of M(IO3)(2)(-) (M = H, Li, Na, K): Structural evolution, optical isomers, and hyperhalogen behavior, J. Chem. Phys., 2013, 139, 4, 044312, https://doi.org/10.1063/1.4816525 . [all data]