B3Au2 anion

Gas phase ion energetics data

Data compiled by: John E. Bartmess

Electron affinity of neutral species

EAneutral (eV) Method Reference Comment
3.170 ± 0.030LPESChen, Bai, et al., 2013Vertical Detachment Energy: 3.22±0.03 eV

References

Chen, Bai, et al., 2013
Chen, Q.; Bai, H.; Zhai, H.J.; Li, S.D.; Wang, L.S., Photoelectron spectroscopy of boron-gold alloy clusters and boron boronyl clusters: B3Aun- and B-3(BO)(n)(-) (n=1, 2), J. Chem. Phys., 2013, 139, 4, 044308, https://doi.org/10.1063/1.4816010 . [all data]