UO2Br3 anion

Gas phase ion energetics data

Data compiled by: John E. Bartmess

Electron affinity of neutral species

EAneutral (eV) Method Reference Comment
6.2700 ± 0.0022LPESSu, Dau, et al., 2013Vertical Detachment Energy: 6.37±0.05 eV

References

Su, Dau, et al., 2013
Su, J.; Dau, P.D.; Qiu, Y.H.; Liu, H.T.; Xu, C.F.; Huang, D.L.; Wang, L.S.; Li, J., Probing the Electronic Structure and Chemical Bonding in Tricoordinate Uranyl Complexes UO2X3- (X = F, Cl, Br, I): Competition between Coulomb Repulsion and U-X Bonding, Inorganic Chemistry, 2013, 52, 11, 6617-6626, https://doi.org/10.1021/ic4006482 . [all data]