CF3CH(OH)CH2CH(CF3)O anion

Gas phase ion energetics data

Data compiled by: John E. Bartmess

Electron affinity of neutral species

EAneutral (eV) Method Reference Comment
4.00 ± 0.10LPESShokri, Wang, et al., 2013Vertical Detachment Energy: 4.51±0.10 eV

References

Shokri, Wang, et al., 2013
Shokri, A.; Wang, X.B.; Kass, S.R., Electron-Withdrawing Trifluoromethyl Groups in Combination with Hydrogen Bonds in Polyols: Bronsted Acids, Hydrogen-Bond Catalysts, and Anion Receptors, J. Am. Chem. Soc., 2013, 135, 25, 9525-9530, https://doi.org/10.1021/ja4036384 . [all data]