2'-deoxycytidinide anion

Reaction thermochemistry data

Data compiled by: John E. Bartmess

Individual Reactions

C9H12N3O4- + Hydrogen cation = Deoxycytidine

By formula: C9H12N3O4- + H+ = C9H13N3O4

Quantity Value Units Method Reference Comment
Δr336.76 ± 0.60kcal/molCIDCKumari, Devi, et al., 2010gas phase; The entropy of acidity values from the kinetic method given, seem unreasonably small for the structures shown - JEB

References

Kumari, Devi, et al., 2010
Kumari, S.; Devi, C.L.; Prabhakar, S.; Bhanuprakash, K.; Vairaman, M., Estimation of Gas-Phase Acidities of Deoxyribonucleosides: An Experimental and Theoretical Study, J. Am. Soc. Mass Spectrom., 2010, 21, 1, 136-143, https://doi.org/10.1016/j.jasms.2009.09.019 . [all data]