Bi2C4H4N anion

Gas phase ion energetics data

Data compiled by: John E. Bartmess

Electron affinity of neutral species

EAneutral (eV) Method Reference Comment
2.250 ± 0.070LPESSun, Sun, et al., 2013Calculations imply that metal is attached at the N

References

Sun, Sun, et al., 2013
Sun, Z.; Sun, S.T.; Liu, H.T.; Tang, Z.C.; Gao, Z., Photoelectron Spectroscopic and Theoretical Study of Aromatic-Bi-m Anionic Complexes (Aromatic = C6H5, C5H4N, C4H3O, and C4H4N; m=1-3): A Comparative Study, J. Phys. Chem. A, 2013, 117, 20, 4127-4135, https://doi.org/10.1021/jp401222k . [all data]