Au5S anion

Gas phase ion energetics data

Data compiled by: John E. Bartmess

Electron affinity of neutral species

EAneutral (eV) Method Reference Comment
3.430 ± 0.040LPESWen, Liu, et al., 2013Vertical Detachment Energy: 3.52±0.04 eV

References

Wen, Liu, et al., 2013
Wen, H.; Liu, Y.R.; Huang, T.; Xu, K.M.; Zhang, W.J.; Huang, W.; Wang, L.S., Observation of linear to planar structural transition in sulfur-doped gold clusters: AuxS- (x=2-5), J. Chem. Phys., 2013, 138, 17, 174303, https://doi.org/10.1063/1.4802477 . [all data]