B6Au2 anion

Gas phase ion energetics data

Data compiled by: John E. Bartmess

Electron affinity of neutral species

EAneutral (eV) Method Reference Comment
2.910 ± 0.020LPESChen, Zhai, et al., 2013Vertical Detachment Energy: 2.91±0.02 eV

References

Chen, Zhai, et al., 2013
Chen, Q.; Zhai, H.J.; Li, S.D.; Wang, L.S., On the structures and bonding in boron-gold alloy clusters: B6Aun- and B6Aun (n = 1-3), J. Chem. Phys., 2013, 138, 8, 084306, https://doi.org/10.1063/1.4792501 . [all data]