(C6H6)3V2 anion

Gas phase ion energetics data

Data compiled by: John E. Bartmess

Electron affinity of neutral species

EAneutral (eV) Reference Comment
0.350 ± 0.050Masubuchi, Ohi, et al., 2012

References

Masubuchi, Ohi, et al., 2012
Masubuchi, T.; Ohi, K.; Iwasa, T.; Nakajima, A., Experimental and theoretical studies on the electronic properties of vanadium-benzene sandwich cluster anions, V(n)Bz(n+1)(-) (n=1-5), J. Chem. Phys., 2012, 137, 22, 224305, https://doi.org/10.1063/1.4769776 . [all data]