H2O..tetracyanoethylene radical anion

Gas phase thermochemistry data

Data compiled by: John E. Bartmess

Quantity Value Units Method Reference Comment
Δfgas29.6 ± 5.0kcal/molTherKhuseynov, Fontana, et al., 2012

References

Khuseynov, Fontana, et al., 2012
Khuseynov, D.; Fontana, M.T.; Sanov, A., Photoelectron spectroscopy and photochemistry of tetracyanoethylene radical anion in the gas phase, Chem. Phys. Lett., 2012, 550, 15-18, https://doi.org/10.1016/j.cplett.2012.08.035 . [all data]