(THF)25..I anion

Gas phase ion energetics data

Data compiled by: John E. Bartmess

Electron affinity of neutral species

EAneutral (eV) Method Reference Comment
4.700 ± 0.050LPESYoung, Azar, et al., 2012Stated electron affinity is the Vertical Detachment Energy

References

Young, Azar, et al., 2012
Young, R.M.; Azar, R.J.; Yandell, M.A.; King, S.B.; Head-Gordon, M.; Neumark, D.M., Iodide solvation in tetrahydrofuran clusters: I-(THF)(n)(1 = n = 30), Molecular Physics, 2012, 110, 15-16, 1787-1799, https://doi.org/10.1080/00268976.2012.679637 . [all data]