CH2=C(Ph)CH2 anion

Gas phase ion energetics data

Data compiled by: John E. Bartmess

Protonation reactions

C9H9- + Hydrogen cation = α-Methylstyrene

By formula: C9H9- + H+ = C9H10

Quantity Value Units Method Reference Comment
Δr1613. ± 23.kJ/molG+TSBartmess and Burnham, 1984gas phase; between H2O, MeOH
Quantity Value Units Method Reference Comment
Δr1586. ± 23.kJ/molIMRBBartmess and Burnham, 1984gas phase; between H2O, MeOH

References

Bartmess and Burnham, 1984
Bartmess, J.E.; Burnham, R., Effect of central substituents on the gas phase acidities of propenes, J. Org. Chem., 1984, 49, 1382. [all data]