PO anion

Gas phase ion energetics data

Data compiled by: John E. Bartmess

Protonation reactions

OP- + Hydrogen cation = HOP

By formula: OP- + H+ = HOP

Quantity Value Units Method Reference Comment
Δr1454. ± 40.kJ/molD-EAZittel and Lineberger, 1976gas phase
Quantity Value Units Method Reference Comment
Δr1425. ± 41.kJ/molH-TSZittel and Lineberger, 1976gas phase

References

Zittel and Lineberger, 1976
Zittel, P.F.; Lineberger, W.C., Laser photoelectron spectrometry of PO-, PH-, and PH2-, J. Chem. Phys., 1976, 65, 1236. [all data]