B4(BO)2 anion

Gas phase ion energetics data

Data compiled by: John E. Bartmess

Electron affinity of neutral species

EAneutral (eV) Method Reference Comment
3.540 ± 0.020LPESChen, Zhai, et al., 2012Vertical Detachment Energy: 3.54±0.02 eV

References

Chen, Zhai, et al., 2012
Chen, Q.; Zhai, H.J.; Li, S.D.; Wang, L.S., Probing the structures and chemical bonding of boron-boronyl clusters using photoelectron spectroscopy and computational chemistry: B-4(BO)(n)(-) (n=1-3), J. Chem. Phys., 2012, 137, 4, 044307, https://doi.org/10.1063/1.4737863 . [all data]