cycloheptatrienide anion

Reaction thermochemistry data

Data compiled by: John E. Bartmess

Individual Reactions

C7H7- + Hydrogen cation = 1,3,5-Cycloheptatriene

By formula: C7H7- + H+ = C7H8

Quantity Value Units Method Reference Comment
Δr375.2 ± 2.2kcal/molG+TSBartmess, Scott, et al., 1979gas phase; value altered from reference due to change in acidity scale
Quantity Value Units Method Reference Comment
Δr369.2 ± 2.0kcal/molIMREBartmess, Scott, et al., 1979gas phase; value altered from reference due to change in acidity scale

References

Bartmess, Scott, et al., 1979
Bartmess, J.E.; Scott, J.A.; McIver, R.T., Jr., The gas phase acidity scale from methanol to phenol, J. Am. Chem. Soc., 1979, 101, 6047. [all data]