CH2=C(OMe)CH2 anion
- Formula: C4H7O-
- Molecular weight: 71.0983

Reaction thermochemistry data

Data compiled by: John E. Bartmess
Individual Reactions
By formula: C4H7O- + H+ = C4H8O
Quantity | Value | Units | Method | Reference | Comment |
---|---|---|---|---|---|
ΔrH° | 1614. ± 23. | kJ/mol | G+TS | Bartmess and Burnham, 1984 | gas phase; Between H2O, MeOH |
Quantity | Value | Units | Method | Reference | Comment |
ΔrG° | 1586. ± 23. | kJ/mol | IMRB | Bartmess and Burnham, 1984 | gas phase; Between H2O, MeOH |

Gas phase ion energetics data

Data compiled by: John E. Bartmess
Protonation reactions
By formula: C4H7O- + H+ = C4H8O
Quantity | Value | Units | Method | Reference | Comment |
---|---|---|---|---|---|
ΔrH° | 1614. ± 23. | kJ/mol | G+TS | Bartmess and Burnham, 1984 | gas phase; Between H2O, MeOH |
Quantity | Value | Units | Method | Reference | Comment |
ΔrG° | 1586. ± 23. | kJ/mol | IMRB | Bartmess and Burnham, 1984 | gas phase; Between H2O, MeOH |

References

Bartmess and Burnham, 1984
Bartmess, J.E.; Burnham, R.,
Effect of central substituents on the gas phase acidities of propenes,
J. Org. Chem., 1984, 49, 1382. [all data]