CH2=C(CH=CH2)CH2 anion

Reaction thermochemistry data

Data compiled by: John E. Bartmess

Individual Reactions

C5H7- + Hydrogen cation = Isoprene

By formula: C5H7- + H+ = C5H8

Quantity Value Units Method Reference Comment
Δr385.6 ± 5.1kcal/molG+TSBartmess and McIver Jr., 1979gas phase; Between H2O, MeOH. Acid: isoprene
Quantity Value Units Method Reference Comment
Δr379.0 ± 5.0kcal/molIMRBBartmess and McIver Jr., 1979gas phase; Between H2O, MeOH. Acid: isoprene

References

Bartmess and McIver Jr., 1979
Bartmess, J.E.; McIver Jr., The Gas Phase Acidity Scale in Gas Phase Ion Chemistry, Gas Phase Ion Chemistry, V. 2, M.T. Bowers, Ed., Academic Press, NY, 1979, Ch. 11, Elsevier, 1979. [all data]