pentadienide anion

Reaction thermochemistry data

Data compiled by: John E. Bartmess

Individual Reactions

C5H7- + Hydrogen cation = 1,3-Pentadiene, (E)-

By formula: C5H7- + H+ = C5H8

Quantity Value Units Method Reference Comment
Δr369.2 ± 1.2kcal/molD-EAZimmerman, Gygax, et al., 1978gas phase; Acid: 1,4-pentadiene. (Z)-1,3-pentadiene is 7.0 kcal/mol more stable(weaker acid)
Quantity Value Units Method Reference Comment
Δr364.4 ± 1.9kcal/molH-TSZimmerman, Gygax, et al., 1978gas phase; Acid: 1,4-pentadiene. (Z)-1,3-pentadiene is 7.0 kcal/mol more stable(weaker acid)

Gas phase ion energetics data

Data compiled by: John E. Bartmess

Electron affinity of neutral species

EAneutral (eV) Method Reference Comment
0.910 ± 0.030PDZimmerman, Gygax, et al., 1978Acid: 1,4-pentadiene. (Z)-1,3-pentadiene is 7.0 kcal/mol more stable(weaker acid)

Protonation reactions

C5H7- + Hydrogen cation = 1,3-Pentadiene, (E)-

By formula: C5H7- + H+ = C5H8

Quantity Value Units Method Reference Comment
Δr369.2 ± 1.2kcal/molD-EAZimmerman, Gygax, et al., 1978gas phase; Acid: 1,4-pentadiene. (Z)-1,3-pentadiene is 7.0 kcal/mol more stable(weaker acid)
Quantity Value Units Method Reference Comment
Δr364.4 ± 1.9kcal/molH-TSZimmerman, Gygax, et al., 1978gas phase; Acid: 1,4-pentadiene. (Z)-1,3-pentadiene is 7.0 kcal/mol more stable(weaker acid)

References

Zimmerman, Gygax, et al., 1978
Zimmerman, A.H.; Gygax, R.; Brauman, J.I., Electron photodetachment spectroscopy of polyene anions. Electron affinities of pentadienyl and heptatrienyl radicals, J. Am. Chem. Soc., 1978, 100, 5595. [all data]