H3SiO anion

Gas phase ion energetics data

Data compiled by: John E. Bartmess

Protonation reactions

H3OSi- + Hydrogen cation = H4OSi

By formula: H3OSi- + H+ = H4OSi

Quantity Value Units Method Reference Comment
Δr358.4 ± 4.3kcal/molG+TSDamrauer, Simon, et al., 1991gas phase; Between CF3CH2OH, MeNO2
Quantity Value Units Method Reference Comment
Δr352.0 ± 4.2kcal/molIMRBDamrauer, Simon, et al., 1991gas phase; Between CF3CH2OH, MeNO2

References

Damrauer, Simon, et al., 1991
Damrauer, R.; Simon, R.; Krempp, M., Effect of Substituents on the Gas-Phase Acidity of Silanols, J. Am. Chem. Soc., 1991, 113, 12, 4431, https://doi.org/10.1021/ja00012a009 . [all data]