CH2=C(Me)CH2 anion

Reaction thermochemistry data

Data compiled by: John E. Bartmess

Individual Reactions

C4H7- + Hydrogen cation = 1-Propene, 2-methyl-

By formula: C4H7- + H+ = C4H8

Quantity Value Units Method Reference Comment
Δr1644. ± 7.5kJ/molEndoWenthold, Hu, et al., 1999gas phase
Δr1619. ± 8.4kJ/molD-EAWenthold, Polak, et al., 1996gas phase
Δr1633. ± 9.6kJ/molG+TSBartmess and Burnham, 1984gas phase
Quantity Value Units Method Reference Comment
Δr1613. ± 7.9kJ/molH-TSWenthold, Hu, et al., 1999gas phase
Δr1588. ± 8.8kJ/molH-TSWenthold, Polak, et al., 1996gas phase
Δr1602. ± 9.2kJ/molIMREBartmess and Burnham, 1984gas phase

Gas phase ion energetics data

Data compiled by: John E. Bartmess

Protonation reactions

C4H7- + Hydrogen cation = 1-Propene, 2-methyl-

By formula: C4H7- + H+ = C4H8

Quantity Value Units Method Reference Comment
Δr1644. ± 7.5kJ/molEndoWenthold, Hu, et al., 1999gas phase
Δr1619. ± 8.4kJ/molD-EAWenthold, Polak, et al., 1996gas phase
Δr1633. ± 9.6kJ/molG+TSBartmess and Burnham, 1984gas phase
Quantity Value Units Method Reference Comment
Δr1613. ± 7.9kJ/molH-TSWenthold, Hu, et al., 1999gas phase
Δr1588. ± 8.8kJ/molH-TSWenthold, Polak, et al., 1996gas phase
Δr1602. ± 9.2kJ/molIMREBartmess and Burnham, 1984gas phase

References

Wenthold, Hu, et al., 1999
Wenthold, P.G.; Hu, J.; Squires, R.R.; Lineberger, W.C., Photoelectron spectroscopy of the trimethylenemethane negative ion, J. Am. Soc. Mass Spectrom., 1999, 10, 9, 800-809, https://doi.org/10.1016/S1044-0305(99)00043-4 . [all data]

Wenthold, Polak, et al., 1996
Wenthold, P.G.; Polak, M.L.; Lineberger, W.C., Photoelectron Spectroscopy of the Allyl and 2-Methylallyl Anions, J. Phys. Chem., 1996, 100, 17, 6920, https://doi.org/10.1021/jp953401n . [all data]

Bartmess and Burnham, 1984
Bartmess, J.E.; Burnham, R., Effect of central substituents on the gas phase acidities of propenes, J. Org. Chem., 1984, 49, 1382. [all data]