CH2=CHCH2 anion

Reaction thermochemistry data

Data compiled by: John E. Bartmess

Individual Reactions

C3H5- + Hydrogen cation = Propene

By formula: C3H5- + H+ = C3H6

Quantity Value Units Method Reference Comment
Δr1636.4 ± 1.3kJ/molG+TSEllison, Davico, et al., 1996gas phase; calculated dSacid=24.2±1.0 eu
Δr1634. ± 4.2kJ/molD-EAWenthold, Polak, et al., 1996gas phase
Δr1635. ± 8.8kJ/molG+TSBartmess, Scott, et al., 1979gas phase; value altered from reference due to change in acidity scale
Δr1632.8 ± 2.7kJ/molG+TSMackay, Lien, et al., 1978gas phase
Quantity Value Units Method Reference Comment
Δr1605.8 ± 0.42kJ/molIMREEllison, Davico, et al., 1996gas phase; calculated dSacid=24.2±1.0 eu
Δr1606. ± 4.6kJ/molH-TSWenthold, Polak, et al., 1996gas phase
Δr1607. ± 8.4kJ/molIMREBartmess, Scott, et al., 1979gas phase; value altered from reference due to change in acidity scale
Δr1605.0 ± 2.1kJ/molIMREMackay, Lien, et al., 1978gas phase

Gas phase ion energetics data

Data compiled by: John E. Bartmess

Protonation reactions

C3H5- + Hydrogen cation = Propene

By formula: C3H5- + H+ = C3H6

Quantity Value Units Method Reference Comment
Δr1636.4 ± 1.3kJ/molG+TSEllison, Davico, et al., 1996gas phase; calculated dSacid=24.2±1.0 eu
Δr1634. ± 4.2kJ/molD-EAWenthold, Polak, et al., 1996gas phase
Δr1635. ± 8.8kJ/molG+TSBartmess, Scott, et al., 1979gas phase; value altered from reference due to change in acidity scale
Δr1632.8 ± 2.7kJ/molG+TSMackay, Lien, et al., 1978gas phase
Quantity Value Units Method Reference Comment
Δr1605.8 ± 0.42kJ/molIMREEllison, Davico, et al., 1996gas phase; calculated dSacid=24.2±1.0 eu
Δr1606. ± 4.6kJ/molH-TSWenthold, Polak, et al., 1996gas phase
Δr1607. ± 8.4kJ/molIMREBartmess, Scott, et al., 1979gas phase; value altered from reference due to change in acidity scale
Δr1605.0 ± 2.1kJ/molIMREMackay, Lien, et al., 1978gas phase

References

Ellison, Davico, et al., 1996
Ellison, G.B.; Davico, G.E.; Bierbaum, V.M.; DePuy, C.H., Thermochemistry of theb Benzyl and Allyl Radicals and Ions, Int. J. Mass Spectrom. Ion Proc., 1996, 156, 1-2, 109-131, https://doi.org/10.1016/S0168-1176(96)04383-2 . [all data]

Wenthold, Polak, et al., 1996
Wenthold, P.G.; Polak, M.L.; Lineberger, W.C., Photoelectron Spectroscopy of the Allyl and 2-Methylallyl Anions, J. Phys. Chem., 1996, 100, 17, 6920, https://doi.org/10.1021/jp953401n . [all data]

Bartmess, Scott, et al., 1979
Bartmess, J.E.; Scott, J.A.; McIver, R.T., Jr., The gas phase acidity scale from methanol to phenol, J. Am. Chem. Soc., 1979, 101, 6047. [all data]

Mackay, Lien, et al., 1978
Mackay, G.I.; Lien, M.H.; Hopkinson, A.C.; Bohme, D.K., Experimental and theoretical studies of proton removal from propene, Can. J. Chem., 1978, 56, 131. [all data]