H2NCHMeCONHCH(CONH2)CH2S-[AlaCysNH2]

Reaction thermochemistry data

Data compiled by: John E. Bartmess

Individual Reactions

C6H12N3O2S + Hydrogen cation = C6H13N3O2S

By formula: C6H12N3O2S + H+ = C6H13N3O2S

Quantity Value Units Method Reference Comment
Δr1404. ± 7.1kJ/molCIDCShen and Ren, 2012gas phase
Quantity Value Units Method Reference Comment
Δr1372. ± 7.1kJ/molCIDCShen and Ren, 2012gas phase

References

Shen and Ren, 2012
Shen, J.L.; Ren, J.H., Gas phase acidity of a cysteine residue in small oligopeptides, Int. J. Mass Spectrom., 2012, 316, 147-156, https://doi.org/10.1016/j.ijms.2012.01.001 . [all data]