Cr4O10 anion

Gas phase ion energetics data

Data compiled by: John E. Bartmess

Electron affinity of neutral species

EAneutral (eV) Method Reference Comment
3.690 ± 0.050LPESLi, Zhai, et al., 2012

References

Li, Zhai, et al., 2012
Li, S.G.; Zhai, H.J.; Wang, L.S.; Dixon, D.A., Structural and Electronic Properties of Reduced Transition Metal Oxide Clusters, M4O10 and M4O10- (M = Cr, W), from Photoelectron Spectroscopy and Quantum Chemical Calculations, J. Phys. Chem. A, 2012, 116, 21, 5256-5271, https://doi.org/10.1021/jp303604k . [all data]