H2O..H2NCOCH2CH2CH(NH2)CO2 anion

Ion clustering data

Data compiled by: John E. Bartmess

Clustering reactions

C5H9N2O3- + Water = C5H11N2O4-

By formula: C5H9N2O3- + H2O = C5H11N2O4-

Quantity Value Units Method Reference Comment
Δr14.40 ± 0.40kcal/molN/AWincel, 2008gas phase
Quantity Value Units Method Reference Comment
Δr5.40 ± 0.80kcal/molTDAsWincel, 2008gas phase

References

Wincel, 2008
Wincel, H., Hydration energies of deprotonated amino acids from gas phase equilibria measurements, J. Am. Soc. Mass Spectrom., 2008, 19, 8, 1091-1097, https://doi.org/10.1016/j.jasms.2008.05.014 . [all data]