H2O..3-IndolylCH2CH(NH2)CO2 anion

Reaction thermochemistry data

Data compiled by: John E. Bartmess

Individual Reactions

L-Tryptophan anion + Water = C11H13N2O3-

By formula: C11H11N2O2- + H2O = C11H13N2O3-

Quantity Value Units Method Reference Comment
Δr61.9 ± 2.1kJ/molN/AWincel, 2008gas phase
Quantity Value Units Method Reference Comment
Δr28.9 ± 3.8kJ/molTDAsWincel, 2008gas phase

References

Wincel, 2008
Wincel, H., Hydration energies of deprotonated amino acids from gas phase equilibria measurements, J. Am. Soc. Mass Spectrom., 2008, 19, 8, 1091-1097, https://doi.org/10.1016/j.jasms.2008.05.014 . [all data]