H2O..PhCH2CH(NH2)CO2 anion

Reaction thermochemistry data

Data compiled by: John E. Bartmess

Individual Reactions

C9H10NO2- + Water = C9H12NO3-

By formula: C9H10NO2- + H2O = C9H12NO3-

Quantity Value Units Method Reference Comment
Δr60.7 ± 1.7kJ/molN/AWincel, 2008gas phase
Quantity Value Units Method Reference Comment
Δr30.1 ± 3.8kJ/molTDAsWincel, 2008gas phase

References

Wincel, 2008
Wincel, H., Hydration energies of deprotonated amino acids from gas phase equilibria measurements, J. Am. Soc. Mass Spectrom., 2008, 19, 8, 1091-1097, https://doi.org/10.1016/j.jasms.2008.05.014 . [all data]