(H2O)2..UO2F4 dianion

Gas phase ion energetics data

Data compiled by: John E. Bartmess

Electron affinity of neutral species

EAneutral (eV) Method Reference Comment
2.030 ± 0.050LPESDau, Su, et al., 2012Vertical Detachment Energy = 2.40±0.05 eV

References

Dau, Su, et al., 2012
Dau, P.D.; Su, J.; Liu, H.T.; Liu, J.B.; Huang, D.L.; Li, J.; Wang, L.S., Observation and investigation of the uranyl tetrafluoride dianion (UO2F42-) and its solvation complexes with water and acetonitrile, Chem. Sci., 2012, 3, 4, 1137-1146, https://doi.org/10.1039/c2sc01052f . [all data]