(CO)3..I anion

Gas phase ion energetics data

Data compiled by: John E. Bartmess

Electron affinity of neutral species

EAneutral (eV) Method Reference Comment
3.280 ± 0.050LPESLapere, LaMacchia, et al., 2012

References

Lapere, LaMacchia, et al., 2012
Lapere, K.M.; LaMacchia, R.J.; Quak, L.H.; Kettner, M.; Dale, S.G.; McKinley, A.J.; Wild, D.A., Anion Photoelectron Spectra and Ab Initio Calculations of the Iodide-Carbon Monoxide Clusters: I-center dot center dot center dot(CO)(n), n=1-4, J. Phys. Chem. A, 2012, 116, 14, 3577-3584, https://doi.org/10.1021/jp300471x . [all data]