bicyclo[2.2.2]octan-1-ide anion

Gas phase ion energetics data

Data compiled by: John E. Bartmess

Electron affinity of neutral species

EAneutral (eV) Reference Comment
0.512 ± 0.069Fattahi, Lis, et al., 2012EA from correlation in 04FAT/KAS

References

Fattahi, Lis, et al., 2012
Fattahi, A.; Lis, L.; Tehrani, Z.A.; Marimanikkuppam, S.S.; Kass, S.R., Experimental and Computational Bridgehead C-H Bond Dissociation Enthalpies, J. Org. Chem., 2012, 77, 4, 1909-1914, https://doi.org/10.1021/jo202519w . [all data]